Home > Error Code > Code Error 65

Code Error 65


All good now! Try again or visit Twitter Status for more information. Skip to main content Developer Zone Join today Log in DevelopmentOSAndroid*Chrome*HTML5Windows*Device2-in-1 & Ultrabook™Business ClientEmbedded SystemsIoTServer, Workstation, HPCTechnologyBig DataDual ScreenGame DevIntel® RealSense™ISA ExtensionsMachine LearningModern CodeNetworkingOpen SourceStorageToolsDeveloper TypeEmbedded SystemsGame DevMediaTechnical, Enterprise, HPCWebOSAll ToolsAndroid*HTML5Linux*OS not with npm itself. navigate to this website

Reply Quote 0 bercik last edited by Hi, same situation here. Thanks. share|improve this answer answered Dec 9 '15 at 0:08 connor 32.9k1596119 add a comment| up vote 2 down vote remove and add ios again ionic platform remove ios ionic platform add Not the answer you're looking for?

Ping Error Code 65

Usually, there is a programming error when you try to access unexpected locations. The build reaches the last stage of codesign validation and I get ** BUILD FAILED ** message immediately after. The build worked...

sudo chown -R $USER:$GROUP ~/.npm sudo chown -R $USER:$GROUP ~/.config jdc91 commented Oct 2, 2016 Thanks @jgw96 For that awesome tip! Generate a 'certificate signing request file' to authenticate the creation of an SSL certificate Create an iOS App ID at Apple Developer Center Optionally, configure the App ID for native features Note that you need to have an Apple developer account. Ping Transmit Failed Error Code 65 npm ERR!

It worked for me. Ldap Error Code 65 npm install -g ios-sim (may require sudo) Install ios-deploy to deploy iOS applications to devices. Something went wrong. stackoverflow.com/questions/36095819/… –gtzinos Sep 30 at 12:45 add a comment| 3 Answers 3 active oldest votes up vote 16 down vote accepted You need a development provisioning profile on your build machine.

I got Qt5.2 rc1 bianry version from website with andorid and ios support. Error Code 65 Xp I also tried on 2 other computers running OsX and another running Windows 8 (My main computer is running Windows 10). Say a lot with a little When you see a Tweet you love, tap the heart — it lets the person who wrote it know you shared the love. I get “Command /usr/bin/codesign failed with exit code 1”0Xcode build failed for Particle photon tinker ios from Github release v1.6_appstore Hot Network Questions Help on a Putnam Problem from the 90s

Ldap Error Code 65

Ionic member jgw96 commented Jun 10, 2016 From @YuvarajManickam on June 10, 2016 10:4 Thank you for your reply @iignatov . In addition National ATM Systems supplies ATM parts, ATM paper, ATM signage, processing, and communications. Ping Error Code 65 Should they change attitude? Error Code 65 Htc Hero Initially it seemed to fix it but then the same issue arose.

RSS Top 23 posts / 0 new Last post For more complete information about compiler optimizations, see our Optimization Notice. http://iembra.org/error-code/code-26530-error-code-00011.php share|improve this answer answered Mar 1 '15 at 14:23 Nimrod Gutman 633618 add a comment| up vote 4 down vote I also had a similar problem, in my case it was Ionic member jgw96 commented Jun 10, 2016 From @iignatov on June 10, 2016 10:14 @YuvarajManickam Have you tried reinstalling XCode? Please review our Privacy Policy to learn more about our collection, use and transfers of your data. Error Code 65 Sprint

Never miss a Moment Catch up instantly on the best stories happening as they unfold. Tap the icon to send it instantly. I've tried using Diawi but it yielded an error saying "Your app could not be downloaded at this time." Thanks :) Top Log in to post comments JOHN H. (Intel) Thu, my review here Try it without using wildcard *.

Can taking a few months off for personal development make it harder to re-enter the workforce? What Is Karmaloop Error Code 65 Or if that isn't available, you can get their info via: npm ERR! Browse other questions tagged ios objective-c iphone xcode xcodebuild or ask your own question.

It will not work with any other email apps.

Compiling in xcode is not really a solution, in my mind. I had to uninstall and re-install the actual plugins, then remove and re-add the platform. stackoverflow.com/questions/36095819/… –gtzinos Sep 30 at 12:45 add a comment| 2 Answers 2 active oldest votes up vote 0 down vote I had the same problem, I fixed it by adding a Error Code 65 For Command Xcodebuild With Args Also, when I tried to when I tried to install ios-deploy am getting following warning, Well, IMHO everything is explained pretty well in the warning, just do what it says: !!!!!!!!!!!!!!!!!!!!!!!!!!!!!!!!!!!!!!!!!!!!!!!!!!!!!!!!!!!!!!!!!!!!!!!!!!!!!!!!

This used to work for me on the same app, but I ran into problems recently. Sign in to comment Contact GitHub API Training Shop Blog About © 2016 GitHub, Inc. if it builds, then you know there is an issue with one of the plugins. get redirected here Top Log in to post comments JOHN H. (Intel) Fri, 03/04/2016 - 06:01 Im not sure what you are talking about.

ARM will continue to operate as an independent business within the SoftBank group. Every once in a while our build fails without any indicative error in the build log. Apps can run on the simulator without a profile, but they are required to run on an actual device. It seems to be a problem with the build script, but my make-fu is weak so it would take me a while to track down.

Failed at the [email protected] preinstall script './src/scripts/check_reqs.js && xcodebuild'. You signed out in another tab or window. Anyways, I was building an IOS app when I came across this error in the bottom of the logs: ** BUILD FAILED ** The following build commands failed: CodeSign build/device/Trump\ Jump.app select Qt 5.2.0 for iOS in the drop-down list that follows the search box (it's on the far right side and very easy to miss) go to Projects and select iphoneos

It is well tested and frequently built on a variety of platforms, so it is known good test case for debugging these issues. What can I say instead of "zorgi"? Fri, 02/26/2016 - 14:36 Wasn't sure how to attach it so I just made a pastebin  http://pastebin.com/88zXSjxZ Thanks for the prompt reply. I've downloaded official Qt 5.2 from 12th of December and i can't build any example project for iOS (for MAC platform it builds and runs ok).

Fri, 03/04/2016 - 03:57  That just downloads the .ipa file, but it doesn't actually install it as an app that I can open. Although, I can't say for sure because I believe you haven't copied the complete error reason in your question (should be above it). Join them; it only takes a minute: Sign up xcode build fails with error code 65 without indicative message up vote 8 down vote favorite 1 I'm experiencing weird behaviour with [email protected] preinstall: `./src/scripts/check_reqs.js && xcodebuild` npm ERR!

Reply Quote 0 eulers_child last edited by And I have the same problem. I've checked if the permissions are correct and search on Google and SO for answers but can't find any answers which apply to this case. EST 0 retweets 0 likes Reply Retweet Retweeted Like Liked More Copy link to Tweet Embed Tweet Back to top ↑ Loading seems to be taking a while.