Home > Error Code > Cmd Error 3010

Cmd Error 3010


In the Command Prompt window, type the following command and press ENTER: cscript adsutil.vbs set w3svc/1/uploadreadaheadsize 500000 For more information, see Client cannot renegotiate request and returns an HTTP 413 error The reporting server URLs are not valid. I was curious to know if we have any option to prevent 3010 from MSI. ERROR_PRODUCT_UNINSTALLED 1615 SQL query syntax invalid or unsupported. useful reference

Even if you can manage to find out what has caused i and looks good in your test machines, once you have set free the packages into the wild they could Symantec Connect User-to-user forums, blogs, videos, and other community resources on Symantec Connect. Find out WHY those files are in use BEFORE the install and close the files (close all applications, stop whatever service, etc.) so that the files are NOT in use prior Jason | http://blog.configmgrftw.com Indeed, I've upped it to 8 hours.

Msi Return Code 3010

ERROR_PATCH_TARGET_NOT_FOUND 1643 The patch package is not permitted by system policy. Information regarding switches listed in this article can be found in this Microsoft Q article: http://support.microsoft.com/default.aspx?scid=kb;EN-US;Q197147Common Command-Line Switches for Self-Installing Update Files (specific to IE installs) /q TCP/IP addressing information has the correct DNS addresses entered. This documentation is archived and is not being maintained.

Server setup fails with an invalid password error During server setup, a failure may occur due to an invalid password error. Legal | Feedback c926729 Tue September 6 19:00:00 EDT 2016"www.itninja.com Log in Sign up! Any help out there on this would be great and thanks in advance to those that reply. Error_success_reboot_required Answered 05/05/2011 by: bearden3 Please log in to comment Please log in to comment 0 We can not do this for 2 reasons. 1.

Contact the application vendor to verify that this is a valid Windows Installer patch package. Msi Error Code 1603 You cannot install the product by running the downloaded file. ERROR_FUNCTION_NOT_CALLED1626The function could not be executed. https://msdn.microsoft.com/en-us/library/windows/desktop/aa376931(v=vs.85).aspx To configure or remove the existing version of this product, use Add/Remove Programs on the Control Panel.

Verify that the patch package exists and is accessible, or contact the application vendor to verify that this is a valid Windows Installer patch package. Error Code 2359303 Contact your support personnel to verify that the Windows Installer service is properly registered. If you feel you are in need of support for a Microsoft product, please go to our technical support site at support.microsoft.com.   Error codeValueDescription ERROR_SUCCESS0The action completed successfully. If don't do that you'll probably always get the 3010 for that application, requiring a reboot.

Msi Error Code 1603

Server setup fails with code 3010 Setup might fail, and inspection of the ServerSetup.log file finds msiexec.exe returned exit code 3010. https://social.technet.microsoft.com/Forums/en-US/19c836d4-d3a6-454c-bae0-9ebfcf54ec99/exit-code-3010-and-forced-reboots?forum=configmanagerapps ERROR_INVALID_COMMAND_LINE1639Invalid command line argument. Msi Return Code 3010 One would assume that a soft reboot can be deffered but in this case SCCM forces a reboot with the default countdown as set in the client settings. Windows Installer Error Codes Windows 10 LTSB One Drive removal Related Links SoftDeployer Home Page K2000 Deployment Appliance Documentation Smart Software Synchronisation Home Page PolicyMaker Home Page ActiSetup Product FAQ Zenworks Suite Support Rembo Auto-Deploy

This article suggests not... A user account or password specified for any of the accounts requested during setup has been entered incorrectly. ERROR_INSTALL_LANGUAGE_UNSUPPORTED 1624 Error applying transforms. This message is indicative of a success. Msi Motherboard Error Codes

Contact your support personnel. Your choices in dealing with this error are 2: 1. The function returns the value ERROR_CALL_NOT_IMPLEMENTED. this page As mentioned, no reboot, no functionality anyway.Jason | http://blog.configmgrftw.com Monday, July 08, 2013 1:25 PM Reply | Quote Microsoft is conducting an online survey to understand your opinion of the Technet

Sign up! Windows Installer Returned 1639 Enter Email Address... Verify that the temp folder exists and that you can write to it.

ERROR_INSTALL_TEMP_UNWRITABLE 1633 This installation package is not supported on this platform.

It prompts saying do you want to install this update and will not continue until you hit yes. No Yes Developer resources Microsoft developer Windows Windows Dev Center Windows apps Desktop Internet of Things Games Holographic Microsoft Edge Hardware Azure Azure Web apps Mobile apps API apps Service Answered 05/05/2011 by: bearden3 Please log in to comment Please log in to comment 0 What bearden3 said could be a good point to start with. Windows 10 1602 Use Error handling within your scripts to work through that error.

ERROR_PATCH_PACKAGE_OPEN_FAILED1635This patch package could not be opened. ERROR_INSTALL_ALREADY_RUNNING 1619 This installation package could not be opened. Contact Us Customer and Technical Support phone numbers and hours of operation. Get More Info ERROR_INSTALL_TRANSFORM_REJECTED1644One or more customizations are not permitted by system policy.

These flavours which are not installed by the App-V client setup also show this behaviour. Answered 05/06/2011 by: dj_xest Please log in to comment Please log in to comment 0 Why use TS at all? Contact your support personnel. ERROR_PATCH_PACKAGE_INVALID 1637 This patch package cannot be processed by the Windows Installer service.

For more information, see the instructions that came with your CD burner. Yes No Do you like the page design? Look at the files listed (it could be tmp files, DLLs, txt files, etc.). ERROR_FUNCTION_FAILED1627The function failed during execution.

Options Print Article Comments RSS Export As PDF Customer Support Software By InstantKB 2015-2 Execution: 0.000. 6 queries. This is not merely a suggestion but a requirement in software delivery as far as Altiris Technical Support is concerned. ERROR_INSTALL_LOG_FAILURE1622There was an error opening installation log file. or login Share Related Questions Trouble Installing Google Chrome MSI Package Visual Studio 2015 Full install with SCCM2012r2 hi...

When run alone there is no problem, it runs and installs with no errors at all. AppEnforce.log Performing detection of app deployment type Microsoft Visual C++ 2005 Redistributable (x86)(ScopeId_C9B67C50-C96A-40F2-BC8F-D804B15217FD/DeploymentType_ae1eb76f-803d-4571-a11a-a7f08d99dbfd, revision 7) for system. Available beginning with Windows Installer version 3.0. Solution This error can occur for two reasons.