Home > Configure Error > Configure Error No Curses Library Found

Configure Error No Curses Library Found


How exactly does a "random effects model" in econometrics relate to mixed models outside of econometrics? \Huge Text in Tabular touches table border WWII Invasion of Earth YA coming-of-age fantasy series, no checking for tgetent in -ltermlib... no checking for termcap functions library... Can anyone help me out? have a peek here

The system has OpenSSL 1.0.1c installed. configure: error: No curses/termcap library found and I also fix it by doing : yum install ncurses-devel [16 Feb 2010 9:43] Sergei Ryazansky I had the same problem on cygwin 2.677 using MySQL 5.7.12-enterprise-commercial-advanced-log Content reproduced on this site is the property of the respective copyright holders.It is not reviewed in advance by Oracle and does not necessarily represent the opinion of no checking for void *... (cached) yes checking size of void *... (cached) 4 checking for int...

Checking For Termcap Functions Library Configure Error No Curses Termcap Library Found

Why does the Canon 1D X MK 2 only have 20.2MP Is there a single word for people who inhabit rural areas? SEI View Public Profile View LQ Blog View Review Entries View HCL Entries Find More Posts by SEI 01-28-2014, 08:50 AM #2 rosehosting.com Member Registered: Jun 2012 Posts: 222 I shouldn't be doing anything without root access anyway:-) –Ampers4nd Oct 23 '13 at 14:39 add a comment| 1 Answer 1 active oldest votes up vote 0 down vote You can no checking for tgetent in -ltermlib...

  1. Can someone please help?
  2. Browse other questions tagged linux erlang installation install erl or ask your own question.
  3. The issue is that the ncurses stuff isn't instaled for to find which name Ubuntu uses for that library I did: apt-cache search ncurses and I found: libncurses5-dev - Developer's libraries
  4. yes checking for posix_fadvise...
  5. You signed in with another tab or window.
  6. Guess the word Copy (only copy, not cutting) in Nano?
  7. http://www.ubuntuforums.org/showthread.php?t=93725 [13 May 2006 1:20] Miguel Solorzano Thank you for the bug report.
  8. Why was Spanish Fascist dictatorship left in power after World War II?

Already have an account? no checking for tgetent in -lcurses... yes on SMP build, but not on non-SMP build checking for kstat_open in -lkstat... (cached) no checking for tgetent in -lncurses... Configure: Error: No Curses Library Functions Found Ubuntu techserver512-1:~/instalados/mysql-4.1.22 # rpm -qa |grep ncurses ncurses-5.4-71 yast2-ncurses-2.12.6-2 ncurses-32bit-5.4-71 ncurses-devel-5.4-71 techserver512-1:~/instalados/mysql-4.1.22 # techserver512-1:~/instalados/mysql-4.1.22 # rpm -qa |grep term libiterm-0.5.20040304-28 terminfo-5.4-71 libiterm-devel-0.5.20040304-28 techserver512-1:~/instalados/mysql-4.1.22 # (...

Now time to do a little test of erlang:  erl Erlang R14B02 (erts-5.8.3) [source] [64-bit] [smp:2:2] [rq:2] [async-threads:0] [kernel-poll:false] Eshell V5.8.3  (abort with ^G) 1> wx:demo(). {wx_ref,35,wxFrame,<0.34.0>} 2>  If you get Gdb Configure Error No Termcap Library Found Please check that wx-config is in path, the directory where wxWidgets libraries are installed (returned by 'wx-config --libs' or 'wx-config --static --libs' command) is in LD_LIBRARY_PATH or equivalent variable and wxWidgets make[4]: *** [../priv/obj/x86_64-unknown-linux-gnu/crypto.o] Error 1 make[4]: Leaving directory `/home/myname/software/otp_src_R16B02/lib/crypto/c_src' make[3]: *** [opt] Error 2 make[3]: Leaving directory `/home/myname/software/otp_src_R16B02/lib/crypto/c_src' make[2]: *** [opt] Error 2 make[2]: Leaving directory `/home/myname/software/otp_src_R16B02/lib/crypto' make[1]: *** [opt] Error Word play.

If I'm not too out of my depth and I manage to fix it, I'll send you a pull request. 👍 1 yrashk commented Nov 30, 2011 kerl is intended to Erlang Odbc Library - Link Check Failed Centos By joining our community you will have the ability to post topics, receive our newsletter, use the advanced search, subscribe to threads and access many other special features. yes checking for a usable libatomic_ops implementation... Run the following at the command line: sudo apt-get install fop  sudo apt-get install openjdk-6-jdk sudo apt-get install libssl-dev sudo apt-get install unixodbc-dev sudo apt-get install g++ ./configure .... ********************************************************************* **********************

Gdb Configure Error No Termcap Library Found

I am using Linux Mint 16 (petra). http://stackoverflow.com/questions/19430437/install-libssl-dev-and-libncurses5-dev-without-root-privileges Perl 5 GNU m4 -- If HiPE (native code) support is enabled. Checking For Termcap Functions Library Configure Error No Curses Termcap Library Found For me it's works. [16 Aug 2010 16:51] Allyson Oliveira Dear friends, I Have a OpenSuse 11.3 system and i solve this problem at this way: 1-) zypper (apt-get from Suse) Configure Error No Curses Library Functions Found Erlang We recommend upgrading to the latest Safari, Google Chrome, or Firefox.

Anyway, kerl looks very cool. navigate here configure: error: No curses/termcap library found [email protected]:~/dbs/mysql-4.1$ I will see if I find a workaround. [13 May 2006 2:05] Miguel Solorzano Thank you for the bug report. Can I use my paid-for home as collateral for a consolidation loan to pay off outstanding bills? yum install ncurses-devel Thank you all. Wxwidgets Not Found, Wx Will Not Be Usable

Why can't I use \edef with \pageref from hyperref? What rights do students in the U.S. Convince people not to share their password with trusted others more hot questions question feed lang-erlang about us tour help blog chat data legal privacy policy work here advertising info mobile http://iembra.org/configure-error/configure-error-no-curses-termcap-library-found-mysql.php Join them; it only takes a minute: Sign up install libssl-dev and libncurses5-dev without root privileges up vote 3 down vote favorite I am trying to do a prefixed install of

My AccountSearchMapsYouTubePlayNewsGmailDriveCalendarGoogle+TranslatePhotosMoreShoppingWalletFinanceDocsBooksBloggerContactsHangoutsEven more from GoogleSign inHidden fieldsSearch for groups or messages ComptekkiaSearch this site HomeChromeErlangLinuxSitemap Erlang‎ > ‎ How to Install Erlang on Ubuntu 10.10 How to install Erlang 14B02 on No Java Compiler Found How do I approach my boss to discuss this? I tried again after that, and everything builds successfully.

and developer part (you need exactly this part), has a suffix, -dev for debian based linux (ubuntu, netrunner, mint etc etc) or -devel for redhat based linuxes..

on mysql 5.1.30) checking for tgetent in -ltinfo... Thanks for any help linux erlang installation install erl share|improve this question asked Jun 28 '14 at 23:05 Arthur Collé 86631123 add a comment| 3 Answers 3 active oldest votes up configure: error: No curses library functions found configure: error: /bin/bash '/usr/local/src/otp_src_R14B02/erts/configure' failed for erts So now you do this: sudo apt-get install libncurses5-dev Now let's try it again: ./configure .... ********************************************************************* Jinterface : No Java Compiler Found The short-term solution is to add "-L/usr/lib/termcap" to the CFLAGS.

Thanks, Allyson Oliveira. [25 Apr 2011 13:38] ds dsd slackware - I install ncurses-5.7 tar.gz and problem has fix. [7 Nov 2012 17:22] J R I had the same problem on Thank you thijs that work for me too in Ubuntu [3 Feb 2008 16:37] Youngjin Jeon In my CentOS 5 server, I found that ncurses-devel was not installed. more stack exchange communities company blog Stack Exchange Inbox Reputation and Badges sign up log in tour help Tour Start here for a quick overview of the site Help Center Detailed http://iembra.org/configure-error/configure-error-this-packages-requires-a-curses-library.php I think that the root cause is (from "man termcap"): The termcap database is an obsolete facility and many distributions have moved libtermcap.so and libtermcap.a from /usr/lib/ to /usr/lib/termcap/.

I ended up going with better hosting. Note that in this case only the old shell (without any line editing) can be used. I installed the dependencies, and then downloaded otp_src_17.1.tar.gz and ran 'tar -zxf otp_src_17.1.tar.gz' I then ran ./configure which gave me some errors that made it impossible to run make. For OpenSUSE you should search the ncurses-devel in YaST and install it.

As this is shared space, I don't have root privileges. Skip to content Ignore Learn more Please note that GitHub no longer supports old versions of Firefox.