Home > Configure Error > Configure Error C Compiler Cannot Create Executables Rvm

Configure Error C Compiler Cannot Create Executables Rvm


noconfigure: error: in `/Users/vindigo/.rvm/src/yaml-0.1.4':configure: error: C compiler cannot create executablesSee `config.log' for more detailsMAKE.LOG-------------------make: *** No targets specified and no makefile found. My home PC has been infected by a virus! Check if a field exists How to make an integer larger than any other integer? But I have this error: BUILD FAILED Inspect or clean up the working tree at /var/folders/fn/1kz6tqdd2b58vl6lggn7ks4r0000gn/T/ruby-build.20130901135911.4559 Results logged to /var/folders/fn/1kz6tqdd2b58vl6lggn7ks4r0000gn/T/ruby-build.20130901135911.4559.log Last 10 log lines: checking build system type... http://iembra.org/configure-error/configure-error-c-compiler-cannot-create-executables.php

configure:3756: $? = 0 configure:3745: gcc -v >&5 Using built-in specs. x86_64-apple-darwin11.2.0 checking whether the C compiler works... slater1 commented May 18, 2016 I was trying to build vim and came to this page on the search term "C compiler cannot create executables" The suggestion to use xcode-select was In my case I fixed the problem installing python by selecting Xcode 7.3.1 –Marco Pelegrini Jun 30 at 17:59 add a comment| up vote 138 down vote I have 10.8 installed weblink

Configure Error C Compiler Cannot Create Executables Ubuntu

Refreshingly, it was written in English and done well at that! The answer by steroscott fixed my issue a while back...this time around not the case. Unit square inside triangle. no checking for awk...

Requirements installation successful. share|improve this answer answered Sep 27 '14 at 17:29 C-Rock 1 add a comment| up vote 0 down vote Make sure there are no spaces in your Xcode application name (can Apple Info Site Map Hot News RSS Feeds Contact Us Copyright © Apple Inc. Configure Error C Compiler Cannot Create Executables Solaris 10 This page may be out of date.

I think I downloaded it as some point. Configure Error C Compiler Cannot Create Executables Solaris First of all, make sure you have upgraded your commandline tools: $ xcode-select --install Now Apple wants you to agree to their license before you can use these tools: $ gcc Browse other questions tagged 12.04 12.10 bash gcc or ask your own question. https://github.com/rvm/rvm/issues/2331 Home Forum Today's Posts | FAQ | Calendar | Community Groups | Forum Actions Mark Forums Read | Quick Links View Site Leaders | Unanswered Posts | Forum Rules Articles Marketplace

At least for me it did. Configure Error C Compiler Cannot Create Executables See Config.log' For More Details Good luck - Joel Posted on Feb 26, 2012 6:03 PM See the answer in context Close Q: Issues installing ruby 1.9.3 - error: C compiler cannot create executables All replies I ran a brew uninstall of gcc (gcc46 for me) and reran the code for the ruby installation (old project old ruby v) $ brew uninstall gcc46 $ rvm install 1.9.3 Dangeranger commented Oct 31, 2013 Hello Michal, The RVM version is 1.23.13.

Configure Error C Compiler Cannot Create Executables Solaris

I used "xcode-select --install" and it worked perfectly. –Blairg23 Jul 9 '14 at 19:23 This seems to fix the issue on Yosemite; even though XCode 6 now comes with http://superuser.com/questions/759363/upgraded-to-mavericks-c-compiler-cannot-create-executables Using rvm 1.10.0 none of the above worked for me. Configure Error C Compiler Cannot Create Executables Ubuntu share|improve this answer answered Dec 9 '12 at 7:33 Kaushik Gopal 3,10353765 add a comment| up vote 1 down vote With brew you can install ruby in a one-liner: brew install Configure Error C Compiler Cannot Create Executables Gentoo I was installing iperf3 and I kept getting the error: "c compiler cannot install executables".

Theoretically, could there be different types of protons and electrons? navigate here Invocation command line was $ ./configure ## --------- ## ## Platform. ## ## --------- ## hostname = j-court-demones-macbook-pro.local uname -m = x86_64 uname -r = 11.3.0 uname -s = Darwin uname After spending days trying to get this to work, His solution was the one that finally got it working for me: edit3 didn'work for me (Xcode 4.2.1), but after installing readline Before installing, make sure you select "Use Clang" just as what Edit 3 of the accepted answer in this thread suggests. Configure Error C Compiler Cannot Create Executables Macports

Halting the installation. yeschecking for a thread-safe mkdir -p... Can a tectonically inactive planet retain a long-term atmosphere? Check This Out Actually it seems like there are no binary rubies for mint 64 bit, so rvm compiles one on its own.

Note 2: If something doesn't work after following the steps, try doing a reboot or re-login to ensure that the environment gets set correctly. Configure Error C Compiler Cannot Create Executables Python How many times will a bell tower ring? Thanks! –Jamie Schembri Nov 7 '11 at 5:25 2 Thanks, Edit 3 fixed it for me too. –echo Nov 14 '11 at 5:23 1 edit3 didn'work for me (Xcode

First, if you read the installation notes for RVM you'll see the following: For Lion, Rubies should be built using gcc rather than llvm-gcc.

  1. Now for the next round of difficulties... –CourtDemone Apr 27 '12 at 23:14 4 If you are reading this answer, this is definitely something you should do, but be aware
  2. Glad it's solved!
  3. I already looked for similar errors in other forums (esp.
  4. Please reopen this issue on ruby-build project and provide the info you've given us here. 👍 1 mislav closed this Sep 1, 2013 sskylar commented Nov 5, 2013 Others coming across
  5. current community chat Stack Overflow Meta Stack Overflow your communities Sign up or log in to customize your list.
  6. no configure: error: in `/Users/jamie/.rvm/src/ruby-1.9.3-p0': configure: error: C compiler cannot create executables See `config.log' for more details GCC is available: gcc -v Using built-in specs.

ruby-1.9.3-p0 - #fetching ruby-1.9.3-p0 - #extracted to /Users/jamie/.rvm/src/ruby-1.9.3-p0 (already extracted) Fetching yaml-0.1.4.tar.gz to /Users/jamie/.rvm/archives Extracting yaml-0.1.4.tar.gz to /Users/jamie/.rvm/src Configuring yaml in /Users/jamie/.rvm/src/yaml-0.1.4. Join Date Nov 2013 Posts 1 GCC - configure - cannot create executables Hey guys, first of all, thanks for everyone who is reading this to help me. Support Apple Support Communities Shop the Apple Online Store (1-800-MY-APPLE), visit an Apple Retail Store, or find a reseller. Configure Error C Compiler Cannot Create Executables Mac build 5484) Copyright (C) 2005 Free Software Foundation, Inc.

i686-pc-linux-gnu checking for gcc... You might need a github something or other, I don't know. It was created by configure, which was generated by GNU Autoconf 2.69. this contact form share|improve this answer edited Sep 19 '13 at 12:55 answered Sep 19 '13 at 12:35 steeldriver 30.7k44473 9 Normally /usr/local/bin is ahead of /usr/bin in PATH for good reason: there's

I've reinstalled Xcode as was recommended in a couple places, but no dice. share|improve this answer edited Feb 23 '12 at 22:50 farnoy 2,70111124 answered Feb 18 '12 at 22:18 Leif 280310 add a comment| up vote 4 down vote Edit3 : doesn't work, Could someone please help. Terms Privacy Security Status Help You can't perform that action at this time.

share|improve this answer answered Mar 1 '12 at 9:23 Dave Smylie 1,58721828 add a comment| up vote 4 down vote You can try to install Command Line Tools for Xcode, it